{"text_format":"1","workbook":"xlsx","n_sheets":10,"sheets":["Macro","A PROJ Instructions","B PROJ Budget","C COMP Instructions","D COMP Budget","E COMP Year 1 Updates","F COMP Year 2 Updates","G COMP Year 3 Updates","H COMP Activities","Data Validation"],"not_rendered":{"charts":0,"images":6,"macros":1,"external_links":0,"defined_names":17,"comments":0,"pivot_tables":0},"unopened":[],"bounds":{"document_bytes":16777216,"sheet_cells":100000,"rows_first":2000,"rows_last":500,"rows_between":2000,"halvings":0,"cell_chars":16384,"cell_head_chars":4096},"cells_cut":0,"cells_raw":0,"read":"whole","date_system":"1900"}

{"sheet":"Macro","index":0,"n_rows":32,"n_cols":2,"rows_kept":32,"cut":false,"hidden":false,"merged":[[31,1,32,15],[1,1,1,11],[25,1,25,11],[4,1,4,15],[6,1,7,15],[3,1,3,15],[27,1,27,15],[29,1,29,15],[14,1,15,15],[17,1,17,15],[20,1,20,15]]}
[null,{"$f":"'Data Validation'!A1","v":"v202205"}]
[]
[]
[null,"Supporting Artistic Practice"]
[null,"Sector Innovation and Development"]
[]
[null,"This component supports many types of activities and they have their own section of tabs with budget pages. This document has a built-in macro to help direct you to the section that relates to your activities. Select the relevant button below for your type of activity. "]
[]
[]
[]
[]
[]
[]
[]
[null,"If you selected the wrong grant type, you can return to the \"Macro\" tab to re-select.\nIf your software or computer settings do not allow the buttons to work, you will be able to see all the tabs on this page. Select the tab that has the instructions for your type of activity."]
[]
[]
[null,"Project grants:"]
[]
[]
{"$rows_left_out":13}
{"sheet":"A PROJ Instructions","index":1,"n_rows":40,"n_cols":3,"rows_kept":40,"cut":false,"hidden":false,"merged":[[33,2,33,15],[35,1,36,15],[18,2,19,14],[20,2,21,15],[29,1,29,15],[1,1,1,15],[6,1,6,15],[2,1,2,15],[3,1,4,15],[31,1,32,15]]}
[null,{"$f":"'Data Validation'!A1","v":"v202205"}]
[null,"Supporting Artistic Practice: Sector Innovation and Development – Project Grants"]
[null,"Instructions for filling out the Budget document"]
[null,"For Composite Grant instructions, go to tab C"]
[]
[null,"Please note that there are many tabs at the bottom of the page."]
[null,"Applicants for project grants need to refer only to the first 2 tabs: A PROJ Instructions and B PROJ Budget. There are no appendices for project applications."]
[]
[]
[]
[null,"Each tab after these instructions contains a separate page for you to fill out."]
[null,"When you click \"Save,\" you will save all the tabs at once."]
[null,"When you upload the document to your application form, all the tabs are transferred together."]
[]
[null,"1. After you download this form, save it on your computer. You can save it with a different name."]
[]
[null,"2. Fill out the tab titled \"B PROJ Budget\" "]
[null,null," - Fill out the Costs of the budget including notes to explain your calculations and if the expense is to be paid for by the Canada Council grant."]
[null,null," - If your project includes costs for making the project accessible to participants who are Deaf or have disabilities, enter these costs in the section \"Public accessibility costs\" starting on line 36 of B PROJ Budget."]
[]
{"$rows_left_out":21}
{"sheet":"B PROJ Budget","index":2,"n_rows":168,"n_cols":9,"rows_kept":168,"cut":false,"hidden":false,"merged":[[76,1,76,8],[124,7,124,8],[128,7,128,8],[132,7,132,8],[136,7,136,8],[104,7,104,8],[78,1,78,3],[89,2,90,4],[95,7,95,8],[88,1,88,8],[98,7,98,8],[101,7,101,8],[167,1,168,8],[86,1,86,3],[65,1,65,8],[69,1,69,3],[70,1,70,3],[79,1,79,3],[81,1,81,3],[82,1,82,3],[83,1,83,3],[84,1,84,3],[71,1,71,3],[72,1,72,3],[73,1,73,3],[74,1,74,3],[77,1,77,3],[89,8,90,8],[58,1,58,3],[68,1,68,3],[63,1,63,3],[52,1,52,3],[61,1,61,3],[39,1,39,3],[40,1,40,3],[41,1,41,3],[29,1,29,3],[30,1,30,3],[31,1,31,3],[38,1,38,3],[35,1,35,3],[37,1,37,3],[36,1,36,3],[42,1,42,3],[43,1,43,3],[53,1,53,3],[67,1,67,3],[47,1,47,3],[48,1,48,3],[59,1,59,3],[60,1,60,3],[54,1,54,3],[55,1,55,3],[56,1,56,3],[57,1,57,3],[49,1,49,3],[44,1,44,3],[45,1,45,3],[46,1,46,3],[1,1,1,8],[3,1,3,8],[5,1,5,3],[6,8,9,8],[17,1,17,3],[11,1,11,8],[12,1,12,8],[13,1,13,3],[16,1,16,3],[6,1,9,3],[15,1,15,3],[14,1,14,3],[18,1,18,3],[23,1,23,8],[27,1,27,3],[28,1,28,3],[19,1,19,3],[20,1,20,3],[21,1,21,3],[25,1,25,3],[26,1,26,3]]}
[null,{"$f":"'Data Validation'!A1","v":"v202205"}]
[null,"Supporting Artistic Practice: Sector Innovation and Development – Project Grants"]
[]
[null,"Salaries, fees and expenses that are part of Canada Council core grants are not eligible in this component"]
[]
[null," Fill out the items below that pertain to your project",null,null,"Budget","Update 1\n(if required)","Update 2\n(if required)","Actual","Budget notes\n(required)"]
[null,"Project dates\n(must reflect your work plan/timeline)",null,null,"Start date","Start date","Start date","Start date","Please indicate in the budget notes if the cost is to be covered by the Canada Council grant"]
[null,null,null,null,"dd-mmm-yyyy","dd-mmm-yyyy","dd-mmm-yyyy","dd-mmm-yyyy"]
[null,null,null,null,"End date ","End date ","End date ","End date "]
[null,null,null,null,"dd-mmm-yyyy","dd-mmm-yyyy","dd-mmm-yyyy","dd-mmm-yyyy"]
[]
[null,"Professional fees and honoraria "]
[null,"Amounts paid to artists, arts professionals, experts, trainers, facilitators, project managers, consultants, Indigenous Elders and community leaders and other professionals directly involved in carrying out your project. For projects of 5 days or more in duration, you may include either an appropriate fee for your services or subsistence up to $500/person/week. Include details in budget notes."]
[]
[]
[]
[]
[]
[]
[]
{"$rows_left_out":149}
{"sheet":"C COMP Instructions","index":3,"n_rows":50,"n_cols":3,"rows_kept":50,"cut":false,"hidden":false,"merged":[[46,1,47,15],[51,2,51,15],[1,1,1,15],[2,1,2,15],[25,2,26,14],[43,1,43,15],[44,2,44,15],[27,2,28,15],[21,2,22,15],[23,2,24,15],[3,1,4,15],[41,1,41,15]]}
[null,{"$f":"'Data Validation'!A1","v":"v202205"}]
[null,"Supporting Artistic Practice: Sector Innovation and Development – Composite Grants"]
[null,"Instructions for filling out the Budget and Appendices documents"]
[null,"For Project Grant instructions, go to tab A"]
[]
[null,"Please note that there are many tabs at the bottom of the page."]
[null,"Applicants for composite grants need to refer to tabs C, D and H when applying."]
[]
[]
[]
[null,"If the application is successful, you will need to refer to tabs E, F and G."]
[]
[]
[]
[null,"Each tab after these instructions contains a separate page for you to fill out."]
[null,"When you click \"Save,\" you will save all the tabs at once."]
[null,"When you upload the document to your application form, all the tabs are transferred together."]
[]
[null,"1. After you download this form, save it on your computer. You can save it with a different name."]
[]
{"$rows_left_out":31}
{"sheet":"D COMP Budget","index":4,"n_rows":240,"n_cols":11,"rows_kept":240,"cut":false,"hidden":false,"merged":[[1,1,1,6],[9,1,9,6],[39,1,39,6],[24,1,24,6],[10,1,10,6],[4,6,7,6],[4,1,7,1],[131,1,131,6],[112,1,112,6],[129,1,129,6],[177,1,177,6],[239,1,240,6]]}
[null,{"$f":"'Data Validation'!A1","v":"v202205"}]
[null,"Supporting Artistic Practice: Sector Innovation and Development – Composite Grants"]
[null,"\n(must equal Total project costs)"]
[null," Fill out the items below that pertain to your activities","Budget Year 1","Budget Year 2 \n(if applicable)","Budget Year 3 \n(if applicable)","Total budget for all years","Budget notes\n(required)"]
[null,"Project dates\n(must reflect your work plan/timeline)","Start date","Start date","Start date",null,"Please indicate in the budget notes if the cost is to be covered by the Canada Council grant"]
[null,null,"dd-mmm-yyyy","dd-mmm-yyyy","dd-mmm-yyyy"]
[null,null,"End date","End date","End date"]
[null,null,"dd-mmm-yyyy","dd-mmm-yyyy","dd-mmm-yyyy"]
[]
[null,"Professional fees and honoraria"]
[null,"Amounts paid to artists, arts professionals, experts, trainers, facilitators, project managers, consultants, Indigenous Elders and community leaders and other professionals directly involved in carrying out your project. For projects of 5 days or more in duration, you may include either an appropriate fee for your services or subsistence up to $500/person/week. Include details in budget notes."]
[null,null,null,null,null,{"$f":"C12+D12+E12","v":0}]
[null,null,null,null,null,0]
[null,null,null,null,null,0]
[null,null,null,null,null,0]
[null,null,null,null,null,0]
[null,null,null,null,null,0]
[null,null,null,null,null,0]
[null,null,null,null,null,0]
[null,null,null,null,null,0]
{"$rows_left_out":221}
{"sheet":"E COMP Year 1 Updates","index":5,"n_rows":240,"n_cols":7,"rows_kept":240,"cut":false,"hidden":false,"merged":[[239,1,240,6],[1,1,1,6],[9,1,9,6],[24,1,24,6],[39,1,39,6],[112,1,112,6],[4,1,7,1],[4,6,7,6],[10,1,10,6],[131,1,131,6],[164,1,164,6],[177,1,177,6],[129,1,129,6]]}
[null,{"$f":"'Data Validation'!A1","v":"v202205"}]
[null,"Supporting Artistic Practice: Sector Innovation and Development – Composite Grants (Year 1 Updates)"]
[]
[null," Fill out the items below that pertain to your activities","Budget Year 1","Year 1 Update 1\n(if required)","Year 1 Update 2\n(if required)","Year 1\nActual","Budget notes\n(required)"]
[null,"Your entries in the rows below are forwarded from the last budget. You can change them if necessary.","Start date","Start date","Start date","Start date","Please indicate in the budget notes if the cost is to be covered by the Canada Council grant."]
[null,null,"dd-mmm-yyyy","dd-mmm-yyyy","dd-mmm-yyyy","dd-mmm-yyyy"]
[null,null,"End date","End date","End date","End date"]
[null,null,"dd-mmm-yyyy","dd-mmm-yyyy","dd-mmm-yyyy","dd-mmm-yyyy"]
[]
[null,"Professional fees and honoraria"]
[null,"Amounts paid to artists, arts professionals, experts, trainers, facilitators, project managers, consultants, Indigenous Elders and community leaders and other professionals directly involved in carrying out your project. For projects of 5 days or more in duration, you may include either an appropriate fee for your services or subsistence up to $500/person/week. Include details in budget notes."]
[null,{"$f":"IF(ISBLANK('D COMP Budget'!B12),\"\",'D COMP Budget'!B12)","v":""},{"$f":"'D COMP Budget'!C12","v":0}]
[null,{"$f":"IF(ISBLANK('D COMP Budget'!B13),\"\",'D COMP Budget'!B13)","v":""},{"$f":"'D COMP Budget'!C13","v":0}]
[null,{"$f":"IF(ISBLANK('D COMP Budget'!B14),\"\",'D COMP Budget'!B14)","v":""},{"$f":"'D COMP Budget'!C14","v":0}]
[null,{"$f":"IF(ISBLANK('D COMP Budget'!B15),\"\",'D COMP Budget'!B15)","v":""},{"$f":"'D COMP Budget'!C15","v":0}]
[null,{"$f":"IF(ISBLANK('D COMP Budget'!B16),\"\",'D COMP Budget'!B16)","v":""},{"$f":"'D COMP Budget'!C16","v":0}]
[null,{"$f":"IF(ISBLANK('D COMP Budget'!B17),\"\",'D COMP Budget'!B17)","v":""},{"$f":"'D COMP Budget'!C17","v":0}]
[null,{"$f":"IF(ISBLANK('D COMP Budget'!B18),\"\",'D COMP Budget'!B18)","v":""},{"$f":"'D COMP Budget'!C18","v":0}]
[null,{"$f":"IF(ISBLANK('D COMP Budget'!B19),\"\",'D COMP Budget'!B19)","v":""},{"$f":"'D COMP Budget'!C19","v":0}]
[null,{"$f":"IF(ISBLANK('D COMP Budget'!B20),\"\",'D COMP Budget'!B20)","v":""},{"$f":"'D COMP Budget'!C20","v":0}]
{"$rows_left_out":221}
{"sheet":"F COMP Year 2 Updates","index":6,"n_rows":240,"n_cols":10,"rows_kept":240,"cut":false,"hidden":false,"merged":[[239,1,240,9],[1,1,1,9],[9,1,9,9],[39,1,39,9],[112,1,112,9],[4,1,7,1],[24,1,24,9],[10,1,10,9],[129,1,129,9],[131,1,131,9],[164,1,164,9],[177,1,177,9],[4,9,6,9]]}
[null,{"$f":"'Data Validation'!A1","v":"v202205"}]
[null,"Supporting Artistic Practice: Sector Innovation and Development – Composite Grants (Year 2 Updates)"]
[]
[null," Fill out the items below that pertain to your activities","Year 1 Actual","Budget Year 2","Year 2 Update 1\n(if required)","Year 2 Update 2\n(if required)","Year 2 Update 3\n(if required)","Year 2 Actual","Year 1 and 2\nActual","Budget notes\n(Required)"]
[null,"Your entries in the rows below are forwarded from the last budget. You can change them if necessary.","Start date","Start date","Start date","Start date","Start date","Start date",null,"Please indicate in the budget notes if the cost is to be covered by the Canada Council grant."]
[null,null,"dd-mmm-yyyy","dd-mmm-yyyy","dd-mmm-yyyy","dd-mmm-yyyy","dd-mmm-yyyy","dd-mmm-yyyy"]
[null,null,"End date","End date","End date","End date","End date","End date"]
[null,null,"dd-mmm-yyyy","dd-mmm-yyyy","dd-mmm-yyyy","dd-mmm-yyyy","dd-mmm-yyyy","dd-mmm-yyyy"]
[]
[null,"Professional fees and honoraria"]
[null,"Amounts paid to artists, arts professionals, experts, trainers, facilitators, project managers, consultants, Indigenous Elders and community leaders and other professionals directly involved in carrying out your project. For projects of 5 days or more in duration, you may include either an appropriate fee for your services or subsistence up to $500/person/week. Include details in budget notes."]
[null,{"$f":"IF(ISBLANK('E COMP Year 1 Updates'!B12),\"\",'E COMP Year 1 Updates'!B12)","v":""},{"$f":"+'E COMP Year 1 Updates'!F12","v":0},{"$f":"+'D COMP Budget'!D12","v":0},null,null,null,null,{"$f":"C12+H12","v":0}]
[null,{"$f":"IF(ISBLANK('E COMP Year 1 Updates'!B13),\"\",'E COMP Year 1 Updates'!B13)","v":""},{"$f":"+'E COMP Year 1 Updates'!F13","v":0},{"$f":"+'D COMP Budget'!D13","v":0},null,null,null,null,0]
[null,{"$f":"IF(ISBLANK('E COMP Year 1 Updates'!B14),\"\",'E COMP Year 1 Updates'!B14)","v":""},{"$f":"+'E COMP Year 1 Updates'!F14","v":0},{"$f":"+'D COMP Budget'!D14","v":0},null,null,null,null,0]
[null,{"$f":"IF(ISBLANK('E COMP Year 1 Updates'!B15),\"\",'E COMP Year 1 Updates'!B15)","v":""},{"$f":"+'E COMP Year 1 Updates'!F15","v":0},{"$f":"+'D COMP Budget'!D15","v":0},null,null,null,null,0]
[null,{"$f":"IF(ISBLANK('E COMP Year 1 Updates'!B16),\"\",'E COMP Year 1 Updates'!B16)","v":""},{"$f":"+'E COMP Year 1 Updates'!F16","v":0},{"$f":"+'D COMP Budget'!D16","v":0},null,null,null,null,0]
[null,{"$f":"IF(ISBLANK('E COMP Year 1 Updates'!B17),\"\",'E COMP Year 1 Updates'!B17)","v":""},{"$f":"+'E COMP Year 1 Updates'!F17","v":0},{"$f":"+'D COMP Budget'!D17","v":0},null,null,null,null,0]
[null,{"$f":"IF(ISBLANK('E COMP Year 1 Updates'!B18),\"\",'E COMP Year 1 Updates'!B18)","v":""},{"$f":"+'E COMP Year 1 Updates'!F18","v":0},{"$f":"+'D COMP Budget'!D18","v":0},null,null,null,null,0]
[null,{"$f":"IF(ISBLANK('E COMP Year 1 Updates'!B19),\"\",'E COMP Year 1 Updates'!B19)","v":""},{"$f":"+'E COMP Year 1 Updates'!F19","v":0},{"$f":"+'D COMP Budget'!D19","v":0},null,null,null,null,0]
[null,{"$f":"IF(ISBLANK('E COMP Year 1 Updates'!B20),\"\",'E COMP Year 1 Updates'!B20)","v":""},{"$f":"+'E COMP Year 1 Updates'!F20","v":0},{"$f":"+'D COMP Budget'!D20","v":0},null,null,null,null,0]
{"$rows_left_out":221}
{"sheet":"G COMP Year 3 Updates","index":7,"n_rows":240,"n_cols":11,"rows_kept":240,"cut":false,"hidden":false,"merged":[[1,1,1,10],[9,1,9,10],[98,2,98,10],[198,2,198,10],[204,2,204,10],[112,1,112,10],[129,1,129,10],[10,1,10,10],[4,9,7,9],[4,10,7,10],[239,1,240,10],[192,2,192,10],[4,1,7,1],[24,1,24,10],[144,2,144,10],[150,2,150,10],[156,2,156,10],[169,2,169,10],[39,1,39,9],[132,2,132,10],[138,2,138,10],[177,1,177,10],[164,1,164,10],[131,1,131,10]]}
[null,{"$f":"'Data Validation'!A1","v":"v202205"}]
[null,"Supporting Artistic Practice: Sector Innovation and Development – Composite Grants (Year 3 Updates)"]
[]
[null," Fill out the items below that pertain to your activities","Year 1\nActual","Year 2\nActual","Budget Year 3","Year 3 Update 1\n(if required)","Year 3 Update 2 \n(if required)","Year 3 Update 3\n(if required)","Year 3\nActual","Years 1, 2 and 3 Actual","Budget notes\n(required)"]
[null,"Your entries in the rows below are forwarded from the last budget. You can change them if necessary.","Start date","Start date","Start date","Start date","Start date","Start date","Start date",null,"Please indicate in the budget notes if the cost is to be covered by the Canada Council grant"]
[null,null,"dd-mmm-yyyy","dd-mmm-yyyy","dd-mmm-yyyy","dd-mmm-yyyy","dd-mmm-yyyy","dd-mmm-yyyy","dd-mmm-yyyy"]
[null,null,"End date","End date","End date","End date","End date","End date","End date"]
[null,null,"dd-mmm-yyyy","dd-mmm-yyyy","dd-mmm-yyyy","dd-mmm-yyyy","dd-mmm-yyyy","dd-mmm-yyyy","dd-mmm-yyyy"]
[]
[null,"Professional fees and honoraria"]
[null,"Amounts paid to artists, arts professionals, experts, trainers, facilitators, project managers, consultants, Indigenous Elders and community leaders and other professionals directly involved in carrying out your project. For projects of 5 days or more in duration, you may include either an appropriate fee for your services or subsistence up to $500/person/week. Include details in budget notes."]
[null,{"$f":"IF(ISBLANK('F COMP Year 2 Updates'!B12),\"\",'F COMP Year 2 Updates'!B12)","v":""},{"$f":"+'E COMP Year 1 Updates'!F12","v":0},{"$f":"+'F COMP Year 2 Updates'!H12","v":0},{"$f":"+'D COMP Budget'!E12","v":0},null,null,null,null,{"$f":"C12+D12+I12","v":0}]
[null,{"$f":"IF(ISBLANK('F COMP Year 2 Updates'!B13),\"\",'F COMP Year 2 Updates'!B13)","v":""},{"$f":"+'E COMP Year 1 Updates'!F13","v":0},{"$f":"+'F COMP Year 2 Updates'!H13","v":0},{"$f":"+'D COMP Budget'!E13","v":0},null,null,null,null,0]
[null,{"$f":"IF(ISBLANK('F COMP Year 2 Updates'!B14),\"\",'F COMP Year 2 Updates'!B14)","v":""},{"$f":"+'E COMP Year 1 Updates'!F14","v":0},{"$f":"+'F COMP Year 2 Updates'!H14","v":0},{"$f":"+'D COMP Budget'!E14","v":0},null,null,null,null,0]
[null,{"$f":"IF(ISBLANK('F COMP Year 2 Updates'!B15),\"\",'F COMP Year 2 Updates'!B15)","v":""},{"$f":"+'E COMP Year 1 Updates'!F15","v":0},{"$f":"+'F COMP Year 2 Updates'!H15","v":0},{"$f":"+'D COMP Budget'!E15","v":0},null,null,null,null,0]
[null,{"$f":"IF(ISBLANK('F COMP Year 2 Updates'!B16),\"\",'F COMP Year 2 Updates'!B16)","v":""},{"$f":"+'E COMP Year 1 Updates'!F16","v":0},{"$f":"+'F COMP Year 2 Updates'!H16","v":0},{"$f":"+'D COMP Budget'!E16","v":0},null,null,null,null,0]
[null,{"$f":"IF(ISBLANK('F COMP Year 2 Updates'!B17),\"\",'F COMP Year 2 Updates'!B17)","v":""},{"$f":"+'E COMP Year 1 Updates'!F17","v":0},{"$f":"+'F COMP Year 2 Updates'!H17","v":0},{"$f":"+'D COMP Budget'!E17","v":0},null,null,null,null,0]
[null,{"$f":"IF(ISBLANK('F COMP Year 2 Updates'!B18),\"\",'F COMP Year 2 Updates'!B18)","v":""},{"$f":"+'E COMP Year 1 Updates'!F18","v":0},{"$f":"+'F COMP Year 2 Updates'!H18","v":0},{"$f":"+'D COMP Budget'!E18","v":0},null,null,null,null,0]
[null,{"$f":"IF(ISBLANK('F COMP Year 2 Updates'!B19),\"\",'F COMP Year 2 Updates'!B19)","v":""},{"$f":"+'E COMP Year 1 Updates'!F19","v":0},{"$f":"+'F COMP Year 2 Updates'!H19","v":0},{"$f":"+'D COMP Budget'!E19","v":0},null,null,null,null,0]
[null,{"$f":"IF(ISBLANK('F COMP Year 2 Updates'!B20),\"\",'F COMP Year 2 Updates'!B20)","v":""},{"$f":"+'E COMP Year 1 Updates'!F20","v":0},{"$f":"+'F COMP Year 2 Updates'!H20","v":0},{"$f":"+'D COMP Budget'!E20","v":0},null,null,null,null,0]
{"$rows_left_out":221}
{"sheet":"H COMP Activities","index":8,"n_rows":48,"n_cols":9,"rows_kept":48,"cut":false,"hidden":false,"merged":[[3,2,3,8],[5,2,5,8],[1,2,1,8]]}
[null,null,{"$f":"'Data Validation'!A1","v":"v202205"}]
[null,null,"Supporting Artistic Practice: Sector Innovation and Development - Composite grants"]
[]
[null,null,"Activities included in your composite grant project"]
[]
[null,null,"Provide a list of the activities covered by the composite grant request beginning with the first year of the grant. The first year should be quite solid, but it is understood that you may have less detail as you go further into the future. Examples of activities to include: Conferences, symposia, research, publication, workshops professional training, mentorships, shared resource platform development, business or support model development, network building, etc. If necessary, group together similar programs or activities. "]
[]
[null,null,"Month/Year or time period","Name of event \n(if applicable)","Type of activity","Key contributor or \nactivity leader","Other major contributors ","Primary beneficiaries","Details/Comments"]
[null,1]
[null,2]
[null,3]
[null,4]
[null,5]
[null,6]
[null,7]
[null,8]
[null,9]
[null,10]
[null,11]
[null,12]
{"$rows_left_out":29}
{"sheet":"Data Validation","index":9,"n_rows":27,"n_cols":6,"rows_kept":27,"cut":false,"hidden":true,"merged":[]}
["v202205"]
[]
[]
[null,null,null,"activity drop down",null,"translate"]
[null,null,null,"SELECT",null,"SÉLECTIONNEZ"]
[null,null,null,"Collection",null,"Collection"]
[null,null,null,"Equipment",null,"Équipement (arts médiatique)"]
[null,null,null,"Production",null,"Production"]
[null,null,null,"Publication",null,"Publication"]
[null,null,null,"Other",null,"Autre"]
[]
[]
[null,null,null,"media arts drop down",null,"translate"]
[null,null,null,"SELECT",null,"SÉLECTIONNEZ"]
[null,null,null,"For distribution",null,"Pour distribution"]
[null,null,null,"For research, archives",null,"Pour recherche et archives"]
[null,null,null,"For rental",null,"Pour location"]
[null,null,null,"Other",null,"Autre"]
[]
[]
{"$rows_left_out":7}