{"text_format":"1","workbook":"xlsx","n_sheets":10,"sheets":["Macro","A PROJ Instructions","B PROJ Budget","C COMP Instructions","D COMP Budget","E COMP Mise à jour Année 1","F COMP Mise à jour Année 2","G COMP Mise à jour Année 3","H COMP Activités","Data Validation"],"not_rendered":{"charts":0,"images":6,"macros":1,"external_links":0,"defined_names":17,"comments":0,"pivot_tables":0},"unopened":[],"bounds":{"document_bytes":16777216,"sheet_cells":100000,"rows_first":2000,"rows_last":500,"rows_between":2000,"halvings":0,"cell_chars":16384,"cell_head_chars":4096},"cells_cut":0,"cells_raw":0,"read":"whole","date_system":"1900"}

{"sheet":"Macro","index":0,"n_rows":32,"n_cols":2,"rows_kept":32,"cut":false,"hidden":false,"merged":[[31,1,32,15],[1,1,1,11],[4,1,4,15],[6,1,7,15],[3,1,3,15],[27,1,27,15],[29,1,29,15],[14,1,15,15],[17,1,17,15],[20,1,20,15]]}
[null,{"$f":"'Data Validation'!A1","v":"v202205"}]
[]
[]
[null,"Appuyer la pratique artistique"]
[null,"Innovation et développement du secteur"]
[]
[null,"Cette composante soutient de nombreux types d'activités qui ont leur propre section d'onglets avec des pages de budget. Ce document comprend une macro intégrée pour vous aider à vous diriger vers la section qui correspond à vos activités. Sélectionnez le bouton ci-dessous correspondant à votre type d'activité."]
[]
[]
[]
[]
[]
[]
[]
[null,"Si vous avez sélectionné le mauvais type de subvention, vous pouvez revenir à l'onglet « Macro » pour faire une nouvelle sélection.\nSi les paramètres de votre logiciel ou de votre ordinateur ne vous permettent pas d'utiliser les boutons, vous verrez tous les onglets sur cette page. Sélectionnez l'onglet qui contient les instructions relatives à votre type d'activité."]
[]
[]
[null,"Subventions de projets :"]
[]
[]
{"$rows_left_out":13}
{"sheet":"A PROJ Instructions","index":1,"n_rows":40,"n_cols":3,"rows_kept":40,"cut":false,"hidden":false,"merged":[[37,1,37,15],[29,1,29,15],[31,1,32,15],[33,2,33,15],[35,1,36,15],[18,2,19,14],[20,2,21,15],[1,1,1,15],[6,1,6,15],[2,1,2,15],[3,1,4,15],[17,2,17,15]]}
[null,{"$f":"'Data Validation'!A1","v":"v202205"}]
[null,"Appuyer la pratique artistique : Innovation et développement du secteur - Subventions de projets"]
[null,"Instructions pour remplir le document du budget"]
[null,"Consultez l'onglet C pour les instructions de subventions composites"]
[]
[null,"Veuillez noter qu'au bas de la page se trouvent plusieurs onglets."]
[null,"Les candidats de subventions de projets doivent seulement consulter les 2 premiers onglets : « A PROJ Instructions » et « B PROJ Budget ». Il n'y a pas d'annexes pour les demandes de projets."]
[]
[]
[]
[null,"Chaque onglet suivant ces instructions contient un document distinct que vous dever remplir."]
[null,"Lorsque vous cliquez sur « Sauvegarder », tous les onglets sont sauvegardés en même temps."]
[null,"Lorsque vous téléversez le document à votre formulaire de demande, tous les onglets y sont transférés ensemble. "]
[]
[null,"1. Après avoir téléchargé le formulaire, sauvegardez-le sur votre ordinateur. Vous pouvez le sauvegarder sous un nom différent."]
[]
[null,"2. Complétez l'onglet « B PROJ Budget »."]
[null,null," - Veuillez inscrire les coûts au budget, y compris les notes expliquant vos calculs et si la dépense doit être financée par la subvention du Conseil des arts."]
[null,null," - Si votre projet inclut des coûts pour rendre le projet accessible aux participants Sourds ou handicapés, inscrivez ces coûts dans la section « Coûts d'accessibilité publique » à partir de la ligne 36 du B PROJ Budget."]
[]
{"$rows_left_out":21}
{"sheet":"B PROJ Budget","index":2,"n_rows":168,"n_cols":9,"rows_kept":168,"cut":false,"hidden":false,"merged":[[76,1,76,8],[124,7,124,8],[128,7,128,8],[132,7,132,8],[136,7,136,8],[104,7,104,8],[78,1,78,3],[89,2,90,4],[95,7,95,8],[88,1,88,8],[98,7,98,8],[101,7,101,8],[167,1,168,8],[86,1,86,3],[65,1,65,8],[69,1,69,3],[70,1,70,3],[79,1,79,3],[81,1,81,3],[82,1,82,3],[83,1,83,3],[84,1,84,3],[71,1,71,3],[72,1,72,3],[73,1,73,3],[74,1,74,3],[77,1,77,3],[89,8,90,8],[58,1,58,3],[68,1,68,3],[63,1,63,3],[52,1,52,3],[61,1,61,3],[62,1,62,3],[39,1,39,3],[40,1,40,3],[41,1,41,3],[29,1,29,3],[30,1,30,3],[31,1,31,3],[38,1,38,3],[35,1,35,3],[37,1,37,3],[36,1,36,3],[42,1,42,3],[43,1,43,3],[53,1,53,3],[67,1,67,3],[47,1,47,3],[48,1,48,3],[59,1,59,3],[60,1,60,3],[54,1,54,3],[55,1,55,3],[56,1,56,3],[57,1,57,3],[49,1,49,3],[44,1,44,3],[45,1,45,3],[46,1,46,3],[1,1,1,8],[3,1,3,8],[5,1,5,3],[6,8,9,8],[17,1,17,3],[11,1,11,8],[12,1,12,8],[13,1,13,3],[16,1,16,3],[6,1,9,3],[14,1,14,3],[15,1,15,3],[18,1,18,3],[23,1,23,8],[27,1,27,3],[28,1,28,3],[19,1,19,3],[20,1,20,3],[21,1,21,3],[25,1,25,3],[26,1,26,3],[24,1,24,8]]}
[null,{"$f":"'Data Validation'!A1","v":"v202205"}]
[null,"Appuyer la pratique artistique : Innovation et développement du secteur – Subvention de projets"]
[]
[null,"Salaires et honoraires versés dans le cadre des subventions de base du Conseil des arts du Canada ne sont pas des coûts admissibles"]
[]
[null," Veuillez inscrire ci-dessous les dépenses relatives à votre projet",null,null,"Budget","1ère mise à jour\n(le cas échéant)","2e mise à jour\n(le cas échéant)","Montant réel","Notes au budget\n(requis)"]
[null,"Dates du projet\n(doit refléter votre plan de travail/échéancier)",null,null,"Date de début","Date de début","Date de début","Date de début","Veuillez indiquer dans les notes au budget si le coût doit être financé par la subvention du Conseil des arts."]
[null,null,null,null,"jj-mmm-aaaa","jj-mmm-aaaa","jj-mmm-aaaa","jj-mmm-aaaa"]
[null,null,null,null,"Date de fin ","Date de fin ","Date de fin ","Date de fin "]
[null,null,null,null,"jj-mmm-aaaa","jj-mmm-aaaa","jj-mmm-aaaa","jj-mmm-aaaa"]
[]
[null,"Honoraires professionnels"]
[null,"Montants payés aux artistes artistes, experts, formateurs, animateurs, gestionnaires de projet, consultants, Aînés autochtones et des dirigeants communautaires, ainsi qu'à d'autres professionnels directement impliqués dans la réalisation de votre projet. Pour les projets d’une durée de 5 jours ou plus, vous pouvez inclure des frais appropriés pour vos services ou des frais de subsistance jusqu'à 500 $/personne/semaine. Inclure les détails dans les notes au budget."]
[]
[]
[]
[]
[]
[]
[]
{"$rows_left_out":149}
{"sheet":"C COMP Instructions","index":3,"n_rows":50,"n_cols":3,"rows_kept":50,"cut":false,"hidden":false,"merged":[[46,1,47,15],[51,2,51,15],[1,1,1,15],[2,1,2,15],[25,2,26,14],[43,1,43,15],[44,2,44,15],[27,2,28,15],[21,2,22,15],[23,2,24,15],[3,1,4,15],[49,1,49,15],[41,1,41,15]]}
[null,{"$f":"'Data Validation'!A1","v":"v202205"}]
[null,"Appuyer la pratique artistique : Innovation et développement du secteur – Subventions composites"]
[null,"Instructions pour remplir les documents « Budget et Annexes »"]
[null,"Consultez l'onglet A pour les instructions de subventions de projets."]
[]
[null,"Veuillez noter qu'au bas de la page se trouvent plusieurs onglets."]
[null,"Les candidats aux subventions composites doivent consulter les onglets C, D et H lorsqu’ils soumettent une demande."]
[]
[]
[]
[null,"Si la demande est retenue, vous devrez consulter les onglets E, F et G."]
[]
[]
[]
[null,"Chaque onglet suivant ces instructions contient un document distinct que vous devez remplir."]
[null,"Lorsque vous cliquez sur « Sauvegarder », tous les onglets sont sauvegardés en même temps."]
[null,"Lorsque vous téléversez le document à votre formulaire de demande, tous les onglets y sont transférés ensemble. "]
[]
[null,"1. Après avoir téléchargé le formulaire, sauvegardez-le sur votre ordinateur. Vous pouvez le sauvegarder sous un nom différent."]
[]
{"$rows_left_out":31}
{"sheet":"D COMP Budget","index":4,"n_rows":240,"n_cols":11,"rows_kept":240,"cut":false,"hidden":false,"merged":[[1,1,1,6],[9,1,9,6],[39,1,39,6],[24,1,24,6],[10,1,10,6],[4,6,7,6],[4,1,7,1],[131,1,131,6],[112,1,112,6],[129,1,129,6],[177,1,177,6],[239,1,240,6]]}
[null,{"$f":"'Data Validation'!A1","v":"v202205"}]
[null,"Appuyer la pratique artistique : Innovation et développement du secteur – Subventions composites"]
[null,"\n(must equal Total project costs)"]
[null,"Veuillez inscrire ci-dessous les dépenses relatives à vos activités","Budget, 1er exercice","Budget, 2e exercice \n(s'il y a lieu)","Budget, 3e exercice\n(s'il y a lieu)","Budget total pour tous les exercices","Notes au budget\n(requis)"]
[null,"Dates du projet\n(doit refléter votre plan de travail/échéancier)","Date de début","Date de début","Date de début",null,"Veuillez indiquer dans les notes au budget si le coût doit être financé par la subvention du Conseil des arts."]
[null,null,"jj-mmm-aaaa","jj-mmm-aaaa","jj-mmm-aaaa"]
[null,null,"Date de fin ","Date de fin ","Date de fin "]
[null,null,"jj-mmm-aaaa","jj-mmm-aaaa","jj-mmm-aaaa"]
[]
[null,"Honoraires professionnels"]
[null,"Montants payés aux artistes artistes, experts, formateurs, animateurs, gestionnaires de projet, consultants, Aînés autochtones et des dirigeants communautaires, ainsi qu'à d'autres professionnels directement impliqués dans la réalisation de votre projet. Pour les projets d’une durée de 5 jours ou plus, vous pouvez inclure des frais appropriés pour vos services ou des frais de subsistance jusqu'à 500 $/personne/semaine. Inclure les détails dans les notes au budget."]
[null,null,null,null,null,{"$f":"C12+D12+E12","v":0}]
[null,null,null,null,null,0]
[null,null,null,null,null,0]
[null,null,null,null,null,0]
[null,null,null,null,null,0]
[null,null,null,null,null,0]
[null,null,null,null,null,0]
[null,null,null,null,null,0]
[null,null,null,null,null,0]
{"$rows_left_out":221}
{"sheet":"E COMP Mise à jour Année 1","index":5,"n_rows":240,"n_cols":7,"rows_kept":240,"cut":false,"hidden":false,"merged":[[239,1,240,6],[1,1,1,6],[9,1,9,6],[24,1,24,6],[39,1,39,6],[112,1,112,6],[4,1,7,1],[4,6,7,6],[10,1,10,6],[131,1,131,6],[164,1,164,6],[177,1,177,6],[129,1,129,6]]}
[null,{"$f":"'Data Validation'!A1","v":"v202205"}]
[null,"Appuyer la pratique artistique : Innovation et développement du secteur – Subventions composites (Mise à jour Année 1)"]
[]
[null," Veuillez inscrire ci-dessous les dépenses relatives à vos activités","Budget, 1er exercice","1ère mise à jour, 1er exercice\n(le cas échéant)","2e mise à jour, 1er exercise\n(le cas échéant)","Montant réel,\n1er exercice","Notes au budget\n(requis)"]
[null,"Vos données dans les lignes ci-dessous sont transmises à partir de votre budget précédent. Vous pouvez les modifier si nécessaire.","Date de début","Date de début","Date de début","Date de début","Veuillez indiquer dans les notes au budget si le coût doit être financé par la subvention du Conseil des arts."]
[null,null,"jj-mmm-aaaa","jj-mmm-aaaa","jj-mmm-aaaa","jj-mmm-aaaa"]
[null,null,"Date de fin ","Date de fin ","Date de fin ","Date de fin "]
[null,null,"jj-mmm-aaaa","jj-mmm-aaaa","jj-mmm-aaaa","jj-mmm-aaaa"]
[]
[null,"Honoraires professionnels"]
[null,"Montants payés aux artistes artistes, experts, formateurs, animateurs, gestionnaires de projet, consultants, Aînés autochtones et des dirigeants communautaires, ainsi qu'à d'autres professionnels directement impliqués dans la réalisation de votre projet. Pour les projets d’une durée de 5 jours ou plus, vous pouvez inclure des frais appropriés pour vos services ou des frais de subsistance jusqu'à 500 $/personne/semaine. Inclure les détails dans les notes au budget."]
[null,{"$f":"IF(ISBLANK('D COMP Budget'!B12),\"\",'D COMP Budget'!B12)","v":""},{"$f":"'D COMP Budget'!C12","v":0}]
[null,{"$f":"IF(ISBLANK('D COMP Budget'!B13),\"\",'D COMP Budget'!B13)","v":""},{"$f":"'D COMP Budget'!C13","v":0}]
[null,{"$f":"IF(ISBLANK('D COMP Budget'!B14),\"\",'D COMP Budget'!B14)","v":""},{"$f":"'D COMP Budget'!C14","v":0}]
[null,{"$f":"IF(ISBLANK('D COMP Budget'!B15),\"\",'D COMP Budget'!B15)","v":""},{"$f":"'D COMP Budget'!C15","v":0}]
[null,{"$f":"IF(ISBLANK('D COMP Budget'!B16),\"\",'D COMP Budget'!B16)","v":""},{"$f":"'D COMP Budget'!C16","v":0}]
[null,{"$f":"IF(ISBLANK('D COMP Budget'!B17),\"\",'D COMP Budget'!B17)","v":""},{"$f":"'D COMP Budget'!C17","v":0}]
[null,{"$f":"IF(ISBLANK('D COMP Budget'!B18),\"\",'D COMP Budget'!B18)","v":""},{"$f":"'D COMP Budget'!C18","v":0}]
[null,{"$f":"IF(ISBLANK('D COMP Budget'!B19),\"\",'D COMP Budget'!B19)","v":""},{"$f":"'D COMP Budget'!C19","v":0}]
[null,{"$f":"IF(ISBLANK('D COMP Budget'!B20),\"\",'D COMP Budget'!B20)","v":""},{"$f":"'D COMP Budget'!C20","v":0}]
{"$rows_left_out":221}
{"sheet":"F COMP Mise à jour Année 2","index":6,"n_rows":240,"n_cols":10,"rows_kept":240,"cut":false,"hidden":false,"merged":[[239,1,240,9],[1,1,1,9],[9,1,9,9],[39,1,39,9],[112,1,112,9],[4,1,7,1],[24,1,24,9],[10,1,10,9],[129,1,129,9],[131,1,131,9],[164,1,164,9],[177,1,177,9],[4,9,7,9]]}
[null,{"$f":"'Data Validation'!A1","v":"v202205"}]
[null,"Appuyer la pratique artistique : Innovation et développement du secteur – Subventions composites (Mise à jour Année 2)"]
[]
[null," Veuillez inscrire ci-dessous les dépenses relatives à vos activités","Montant réel,\n1er exercice","Budget, 2e exercice ","1ère mise à jour, 2e exercice\n(le cas échéant)","2e mise à jour, 2e exercice\n(le cas échéant)","3e mise à jour, 2e exercice\n(le cas échéant)","Montant réel,\n2e exercice","Montant réel,\n1er et 2e exercices","Notes au budget\n(requis)"]
[null,"Vos données dans les lignes ci-dessous sont transmises à partir de votre budget précédent. Vous pouvez les modifier si nécessaire.","Date de début","Date de début","Date de début","Date de début","Date de début","Date de début",null,"Veuillez indiquer dans les notes au budget si le coût doit être financé par la subvention du Conseil des arts."]
[null,null,"jj-mmm-aaaa","jj-mmm-aaaa","jj-mmm-aaaa","jj-mmm-aaaa","jj-mmm-aaaa","jj-mmm-aaaa"]
[null,null,"Date de fin ","Date de fin ","Date de fin ","Date de fin ","Date de fin ","Date de fin "]
[null,null,"jj-mmm-aaaa","jj-mmm-aaaa","jj-mmm-aaaa","jj-mmm-aaaa","jj-mmm-aaaa","jj-mmm-aaaa"]
[]
[null,"Honoraires professionnels"]
[null,"Montants payés aux artistes artistes, experts, formateurs, animateurs, gestionnaires de projet, consultants, Aînés autochtones et des dirigeants communautaires, ainsi qu'à d'autres professionnels directement impliqués dans la réalisation de votre projet. Pour les projets d’une durée de 5 jours ou plus, vous pouvez inclure des frais appropriés pour vos services ou des frais de subsistance jusqu'à 500 $/personne/semaine. Inclure les détails dans les notes au budget."]
[null,{"$f":"IF(ISBLANK('E COMP Mise à jour Année 1'!B12),\"\",'E COMP Mise à jour Année 1'!B12)","v":""},{"$f":"+'E COMP Mise à jour Année 1'!F12","v":0},{"$f":"+'D COMP Budget'!D12","v":0},null,null,null,null,{"$f":"C12+H12","v":0}]
[null,{"$f":"IF(ISBLANK('E COMP Mise à jour Année 1'!B13),\"\",'E COMP Mise à jour Année 1'!B13)","v":""},{"$f":"+'E COMP Mise à jour Année 1'!F13","v":0},{"$f":"+'D COMP Budget'!D13","v":0},null,null,null,null,0]
[null,{"$f":"IF(ISBLANK('E COMP Mise à jour Année 1'!B14),\"\",'E COMP Mise à jour Année 1'!B14)","v":""},{"$f":"+'E COMP Mise à jour Année 1'!F14","v":0},{"$f":"+'D COMP Budget'!D14","v":0},null,null,null,null,0]
[null,{"$f":"IF(ISBLANK('E COMP Mise à jour Année 1'!B15),\"\",'E COMP Mise à jour Année 1'!B15)","v":""},{"$f":"+'E COMP Mise à jour Année 1'!F15","v":0},{"$f":"+'D COMP Budget'!D15","v":0},null,null,null,null,0]
[null,{"$f":"IF(ISBLANK('E COMP Mise à jour Année 1'!B16),\"\",'E COMP Mise à jour Année 1'!B16)","v":""},{"$f":"+'E COMP Mise à jour Année 1'!F16","v":0},{"$f":"+'D COMP Budget'!D16","v":0},null,null,null,null,0]
[null,{"$f":"IF(ISBLANK('E COMP Mise à jour Année 1'!B17),\"\",'E COMP Mise à jour Année 1'!B17)","v":""},{"$f":"+'E COMP Mise à jour Année 1'!F17","v":0},{"$f":"+'D COMP Budget'!D17","v":0},null,null,null,null,0]
[null,{"$f":"IF(ISBLANK('E COMP Mise à jour Année 1'!B18),\"\",'E COMP Mise à jour Année 1'!B18)","v":""},{"$f":"+'E COMP Mise à jour Année 1'!F18","v":0},{"$f":"+'D COMP Budget'!D18","v":0},null,null,null,null,0]
[null,{"$f":"IF(ISBLANK('E COMP Mise à jour Année 1'!B19),\"\",'E COMP Mise à jour Année 1'!B19)","v":""},{"$f":"+'E COMP Mise à jour Année 1'!F19","v":0},{"$f":"+'D COMP Budget'!D19","v":0},null,null,null,null,0]
[null,{"$f":"IF(ISBLANK('E COMP Mise à jour Année 1'!B20),\"\",'E COMP Mise à jour Année 1'!B20)","v":""},{"$f":"+'E COMP Mise à jour Année 1'!F20","v":0},{"$f":"+'D COMP Budget'!D20","v":0},null,null,null,null,0]
{"$rows_left_out":221}
{"sheet":"G COMP Mise à jour Année 3","index":7,"n_rows":240,"n_cols":11,"rows_kept":240,"cut":false,"hidden":false,"merged":[[1,1,1,10],[9,1,9,10],[98,2,98,10],[198,2,198,10],[204,2,204,10],[112,1,112,10],[129,1,129,10],[10,1,10,10],[4,9,7,9],[4,10,7,10],[239,1,240,10],[192,2,192,10],[4,1,7,1],[24,1,24,10],[144,2,144,10],[150,2,150,10],[156,2,156,10],[169,2,169,10],[39,1,39,9],[132,2,132,10],[138,2,138,10],[177,1,177,10],[164,1,164,10],[131,1,131,10]]}
[null,{"$f":"'Data Validation'!A1","v":"v202205"}]
[null,"Appuyer la pratique artistique : Innovation et développement du secteur – Subventions composites (Mise à jour Année 3)"]
[]
[null," Veuillez inscrire ci-dessous les dépenses relatives à vos activités","Montant réel,\n1er exercice","Montant réel,\n2e exercice","Budget, 3e exercice","1ère mise à jour, 3e exercice\n(le cas échéant)","2e mise à jour, 3e exercice\n(le cas échéant)","3e mise à jour, 3e exercice\n(le cas échéant)","Montant réel,\n3e exercice","Montant réel, 1er, 2e et 3e exercices","Notes au budget\n(requis)"]
[null,"Vos données dans les lignes ci-dessous sont transmises à partir de votre budget précédent. Vous pouvez les modifier si nécessaire.","Date de début","Date de début","Date de début","Date de début","Date de début","Date de début","Date de début",null,"Veuillez indiquer dans les notes au budget si le coût doit être financé par la subvention du Conseil des arts."]
[null,null,"jj-mmm-aaaa","jj-mmm-aaaa","jj-mmm-aaaa","jj-mmm-aaaa","jj-mmm-aaaa","jj-mmm-aaaa","jj-mmm-aaaa"]
[null,null,"Date de fin ","Date de fin ","Date de fin ","Date de fin ","Date de fin ","Date de fin ","Date de fin "]
[null,null,"jj-mmm-aaaa","jj-mmm-aaaa","jj-mmm-aaaa","jj-mmm-aaaa","jj-mmm-aaaa","jj-mmm-aaaa","jj-mmm-aaaa"]
[]
[null,"Honoraires professionnels"]
[null,"Montants payés aux artistes artistes, experts, formateurs, animateurs, gestionnaires de projet, consultants, Aînés autochtones et des dirigeants communautaires, ainsi qu'à d'autres professionnels directement impliqués dans la réalisation de votre projet. Pour les projets d’une durée de 5 jours ou plus, vous pouvez inclure des frais appropriés pour vos services ou des frais de subsistance jusqu'à 500 $/personne/semaine. Inclure les détails dans les notes au budget."]
[null,{"$f":"IF(ISBLANK('F COMP Mise à jour Année 2'!B12),\"\",'F COMP Mise à jour Année 2'!B12)","v":""},{"$f":"+'E COMP Mise à jour Année 1'!F12","v":0},{"$f":"+'F COMP Mise à jour Année 2'!H12","v":0},{"$f":"+'D COMP Budget'!E12","v":0},null,null,null,null,{"$f":"C12+D12+I12","v":0}]
[null,{"$f":"IF(ISBLANK('F COMP Mise à jour Année 2'!B13),\"\",'F COMP Mise à jour Année 2'!B13)","v":""},{"$f":"+'E COMP Mise à jour Année 1'!F13","v":0},{"$f":"+'F COMP Mise à jour Année 2'!H13","v":0},{"$f":"+'D COMP Budget'!E13","v":0},null,null,null,null,0]
[null,{"$f":"IF(ISBLANK('F COMP Mise à jour Année 2'!B14),\"\",'F COMP Mise à jour Année 2'!B14)","v":""},{"$f":"+'E COMP Mise à jour Année 1'!F14","v":0},{"$f":"+'F COMP Mise à jour Année 2'!H14","v":0},{"$f":"+'D COMP Budget'!E14","v":0},null,null,null,null,0]
[null,{"$f":"IF(ISBLANK('F COMP Mise à jour Année 2'!B15),\"\",'F COMP Mise à jour Année 2'!B15)","v":""},{"$f":"+'E COMP Mise à jour Année 1'!F15","v":0},{"$f":"+'F COMP Mise à jour Année 2'!H15","v":0},{"$f":"+'D COMP Budget'!E15","v":0},null,null,null,null,0]
[null,{"$f":"IF(ISBLANK('F COMP Mise à jour Année 2'!B16),\"\",'F COMP Mise à jour Année 2'!B16)","v":""},{"$f":"+'E COMP Mise à jour Année 1'!F16","v":0},{"$f":"+'F COMP Mise à jour Année 2'!H16","v":0},{"$f":"+'D COMP Budget'!E16","v":0},null,null,null,null,0]
[null,{"$f":"IF(ISBLANK('F COMP Mise à jour Année 2'!B17),\"\",'F COMP Mise à jour Année 2'!B17)","v":""},{"$f":"+'E COMP Mise à jour Année 1'!F17","v":0},{"$f":"+'F COMP Mise à jour Année 2'!H17","v":0},{"$f":"+'D COMP Budget'!E17","v":0},null,null,null,null,0]
[null,{"$f":"IF(ISBLANK('F COMP Mise à jour Année 2'!B18),\"\",'F COMP Mise à jour Année 2'!B18)","v":""},{"$f":"+'E COMP Mise à jour Année 1'!F18","v":0},{"$f":"+'F COMP Mise à jour Année 2'!H18","v":0},{"$f":"+'D COMP Budget'!E18","v":0},null,null,null,null,0]
[null,{"$f":"IF(ISBLANK('F COMP Mise à jour Année 2'!B19),\"\",'F COMP Mise à jour Année 2'!B19)","v":""},{"$f":"+'E COMP Mise à jour Année 1'!F19","v":0},{"$f":"+'F COMP Mise à jour Année 2'!H19","v":0},{"$f":"+'D COMP Budget'!E19","v":0},null,null,null,null,0]
[null,{"$f":"IF(ISBLANK('F COMP Mise à jour Année 2'!B20),\"\",'F COMP Mise à jour Année 2'!B20)","v":""},{"$f":"+'E COMP Mise à jour Année 1'!F20","v":0},{"$f":"+'F COMP Mise à jour Année 2'!H20","v":0},{"$f":"+'D COMP Budget'!E20","v":0},null,null,null,null,0]
{"$rows_left_out":221}
{"sheet":"H COMP Activités","index":8,"n_rows":48,"n_cols":9,"rows_kept":48,"cut":false,"hidden":false,"merged":[[3,2,3,8],[5,2,5,8],[1,2,1,8]]}
[null,null,{"$f":"'Data Validation'!A1","v":"v202205"}]
[null,null,"Appuyer la pratique artistique : Innovation et développement du secteur – Subventions composites "]
[]
[null,null,"Activités incluses dans votre projet de subvention composite"]
[]
[null,null,"Fournissez une liste des activités financées par la demande de subvention composite en commençant par la première année de la subvention. La première année devrait être assez solide, cependant il est entendu que vous pouvez avoir moins de détails à mesure que vous avancez dans le futur.  Exemples d'activités à inclure : Conférences, symposiums, recherche, publication, ateliers, formation professionnelle, mentorat, développement de plateformes de ressources partagées, développement de modèles d'affaires ou de soutien, création de réseaux, etc. Au besoin, regroupez les programmes ou activités similaires."]
[]
[null,null,"Mois/année ou Période de temps","Nom de l'événement\n(le cas échéant)","Type d'activité","Contributeur clé ou Responsable de l'activité","Autres collaborateurs clés","Principaux bénéficiaires","Détails/Commentaires"]
[null,1]
[null,2]
[null,3]
[null,4]
[null,5]
[null,6]
[null,7]
[null,8]
[null,9]
[null,10]
[null,11]
[null,12]
{"$rows_left_out":29}
{"sheet":"Data Validation","index":9,"n_rows":27,"n_cols":6,"rows_kept":27,"cut":false,"hidden":true,"merged":[]}
["v202205"]
[]
[]
[null,null,null,"activity drop down",null,"translate"]
[null,null,null,"SELECT",null,"SÉLECTIONNEZ"]
[null,null,null,"Collection",null,"Collection"]
[null,null,null,"Equipment",null,"Équipement (arts médiatique)"]
[null,null,null,"Production",null,"Production"]
[null,null,null,"Publication",null,"Publication"]
[null,null,null,"Other",null,"Autre"]
[]
[]
[null,null,null,"media arts drop down",null,"translate"]
[null,null,null,"SELECT",null,"SÉLECTIONNEZ"]
[null,null,null,"For distribution",null,"Pour distribution"]
[null,null,null,"For research, archives",null,"Pour recherche et archives"]
[null,null,null,"For rental",null,"Pour location"]
[null,null,null,"Other",null,"Autre"]
[]
[]
{"$rows_left_out":7}